Reaction Details
TargetCarnitine O-palmitoyltransferase 1, liver isoform
LigandBDBM50101599
Substrate/Competitorn/a
Meas. Tech.ChEMBL_46317 (CHEMBL663461)
IC50>300000±n/a nM
Citation Giannessi, FChiodi, PMarzi, MMinetti, PPessotto, PDe Angelis, FTassoni, EConti, RGiorgi, FMabilia, MDell'Uomo, NMuck, STinti, MOCarminati, PArduini, A Reversible carnitine palmitoyltransferase inhibitors with broad chemical diversity as potential antidiabetic agents. J Med Chem44:2383-6 (2001) Carnitine O-palmitoyltransferase 1, liver isoform
Name:Carnitine O-palmitoyltransferase 1, liver isoform
Type:PROTEIN
Mol. Mass.:88147.11
Organism:Rattus norvegicus
Description:ChEMBL_887445
Residue:773
BDBM50101599
NameBDBM50101599
Synonyms:CHEMBL77115 | Trimethyl-[2-tetradecyloxy-3-(2H-tetrazol-5-yl)-propyl]-ammonium
TypeSmall organic molecule
Emp. Form.C21H43N5O
Mol. Mass.381.599
(Cc1nn[n-]n1)C[N+](C)(C)C