Reaction Details
TargetCarnitine O-palmitoyltransferase 1, muscle isoform
LigandBDBM50101589
Substrate/Competitorn/a
Meas. Tech.ChEMBL_46323 (CHEMBL660891)
IC50 3800±n/a nM
Citation Giannessi, FChiodi, PMarzi, MMinetti, PPessotto, PDe Angelis, FTassoni, EConti, RGiorgi, FMabilia, MDell'Uomo, NMuck, STinti, MOCarminati, PArduini, A Reversible carnitine palmitoyltransferase inhibitors with broad chemical diversity as potential antidiabetic agents. J Med Chem44:2383-6 (2001) Carnitine O-palmitoyltransferase 1, muscle isoform
Name:Carnitine O-palmitoyltransferase 1, muscle isoform
Type:PROTEIN
Mol. Mass.:88241.28
Organism:Rattus norvegicus
Description:ChEMBL_887447
Residue:772
BDBM50101589
NameBDBM50101589
Synonyms:CHEMBL77174 | [3-Carboxy-2-(nonylaminosulphonyl-amino)-propyl]-trimethyl-ammonium
TypeSmall organic molecule
Emp. Form.C16H35N3O4S
Mol. Mass.365.532
SMILESCCCCCCCCCNS(=O)(=O)NC(CC([O-])=O)C[N+](C)(C)C