Reaction Details
TargetCarnitine O-palmitoyltransferase 1, liver isoform
LigandBDBM50101598
Substrate/Competitorn/a
Meas. Tech.ChEMBL_46317 (CHEMBL663461)
IC50 700±n/a nM
Citation Giannessi, FChiodi, PMarzi, MMinetti, PPessotto, PDe Angelis, FTassoni, EConti, RGiorgi, FMabilia, MDell'Uomo, NMuck, STinti, MOCarminati, PArduini, A Reversible carnitine palmitoyltransferase inhibitors with broad chemical diversity as potential antidiabetic agents. J Med Chem44:2383-6 (2001) Carnitine O-palmitoyltransferase 1, liver isoform
Name:Carnitine O-palmitoyltransferase 1, liver isoform
Type:PROTEIN
Mol. Mass.:88147.11
Organism:Rattus norvegicus
Description:ChEMBL_887445
Residue:773
BDBM50101598
NameBDBM50101598
Synonyms:CHEMBL307495 | [3-Carboxy-2-(dodecane-1-sulfonylamino)-propyl]-trimethyl-ammonium
TypeSmall organic molecule
Emp. Form.C19H40N2O4S
Mol. Mass.392.597
SMILESCCCCCCCCCCCCS(=O)(=O)N[C@H](CC([O-])=O)C[N+](C)(C)C