Reaction Details
TargetCarnitine O-palmitoyltransferase 1, muscle isoform
LigandBDBM50101604
Substrate/Competitorn/a
Meas. Tech.ChEMBL_46323 (CHEMBL660891)
IC50>10000±n/a nM
Citation Giannessi, FChiodi, PMarzi, MMinetti, PPessotto, PDe Angelis, FTassoni, EConti, RGiorgi, FMabilia, MDell'Uomo, NMuck, STinti, MOCarminati, PArduini, A Reversible carnitine palmitoyltransferase inhibitors with broad chemical diversity as potential antidiabetic agents. J Med Chem44:2383-6 (2001) Carnitine O-palmitoyltransferase 1, muscle isoform
Name:Carnitine O-palmitoyltransferase 1, muscle isoform
Type:PROTEIN
Mol. Mass.:88241.28
Organism:Rattus norvegicus
Description:ChEMBL_887447
Residue:772
BDBM50101604
NameBDBM50101604
Synonyms:CHEMBL309568 | [3-Carboxy-2-(dodecane-1-sulfonylamino)-propyl]-trimethyl-ammonium
TypeSmall organic molecule
Emp. Form.C19H40N2O4S
Mol. Mass.392.597
SMILESCCCCCCCCCCCCS(=O)(=O)N[C@@H](CC([O-])=O)C[N+](C)(C)C