Reaction Details
TargetCarnitine O-palmitoyltransferase 1, liver isoform
LigandBDBM50101607
Substrate/Competitorn/a
Meas. Tech.ChEMBL_46317 (CHEMBL663461)
IC50 122000±n/a nM
Citation Giannessi, FChiodi, PMarzi, MMinetti, PPessotto, PDe Angelis, FTassoni, EConti, RGiorgi, FMabilia, MDell'Uomo, NMuck, STinti, MOCarminati, PArduini, A Reversible carnitine palmitoyltransferase inhibitors with broad chemical diversity as potential antidiabetic agents. J Med Chem44:2383-6 (2001) Carnitine O-palmitoyltransferase 1, liver isoform
Name:Carnitine O-palmitoyltransferase 1, liver isoform
Type:PROTEIN
Mol. Mass.:88147.11
Organism:Rattus norvegicus
Description:ChEMBL_887445
Residue:773
BDBM50101607
NameBDBM50101607
Synonyms:CHEMBL80353 | [3-Carboxy-2-(3-nonyl-thioureido)-propyl]-trimethyl-ammonium
TypeSmall organic molecule
Emp. Form.C17H35N3O2S
Mol. Mass.345.544
SMILESCCCCCCCCCNC(=S)NC(CC([O-])=O)C[N+](C)(C)C