Reaction Details
TargetDelta-type opioid receptor
LigandBDBM50101611
Substrate/Competitorn/a
Meas. Tech.ChEMBL_145325 (CHEMBL750413)
IC50 1.7±n/a nM
Citation Pagé, DNaismith, ASchmidt, RCoupal, MLabarre, MGosselin, MBellemare, DPayza, KBrown, W Novel C-terminus modifications of the Dmt-Tic motif: a new class of dipeptide analogues showing altered pharmacological profiles toward the opioid receptors. J Med Chem44:2387-90 (2001) Delta-type opioid receptor
Name:Delta-type opioid receptor
Type:G Protein-Coupled Receptor (GPCR)
Mol. Mass.:40382.98
Organism:Homo sapiens (Human)
Description:Competition binding assays were carried out using membrane preparations from transfected HN9.10 cells that constitutively expressed the delta opioid receptor.
Residue:372
BDBM50101611
NameBDBM50101611
Synonyms:2-Amino-3-(4-hydroxy-2,6-dimethyl-phenyl)-1-(3-methyl-3,4-dihydro-1H-isoquinolin-2-yl)-propan-1-one | CHEMBL77196
TypeSmall organic molecule
Emp. Form.C21H26N2O2
Mol. Mass.338.4433
SMILESC[C@@H]1Cc2ccccc2CN1C(=O)[C@@H](N)Cc1c(C)cc(O)cc1C