Reaction Details
TargetDelta-type opioid receptor
LigandBDBM50101627
Substrate/Competitorn/a
Meas. Tech.ChEMBL_145325 (CHEMBL750413)
IC50 9.9±n/a nM
Citation Pagé, DNaismith, ASchmidt, RCoupal, MLabarre, MGosselin, MBellemare, DPayza, KBrown, W Novel C-terminus modifications of the Dmt-Tic motif: a new class of dipeptide analogues showing altered pharmacological profiles toward the opioid receptors. J Med Chem44:2387-90 (2001) Delta-type opioid receptor
Name:Delta-type opioid receptor
Type:G Protein-Coupled Receptor (GPCR)
Mol. Mass.:40382.98
Organism:Homo sapiens (Human)
Description:Competition binding assays were carried out using membrane preparations from transfected HN9.10 cells that constitutively expressed the delta opioid receptor.
Residue:372
BDBM50101627
NameBDBM50101627
Synonyms:CHEMBL310146 | N-{2-[2-Amino-3-(4-hydroxy-2,6-dimethyl-phenyl)-propionyl]-1,2,3,4-tetrahydro-isoquinolin-3-ylmethyl}-acetamidine
TypeSmall organic molecule
Emp. Form.C23H30N4O2
Mol. Mass.394.5099
SMILESCC(N)=NC[C@@H]1Cc2ccccc2CN1C(=O)[C@@H](N)Cc1c(C)cc(O)cc1C