Reaction Details
TargetDelta-type opioid receptor
LigandBDBM50101623
Substrate/Competitorn/a
Meas. Tech.ChEMBL_145325 (CHEMBL750413)
IC50 1.6±n/a nM
Citation Pagé, DNaismith, ASchmidt, RCoupal, MLabarre, MGosselin, MBellemare, DPayza, KBrown, W Novel C-terminus modifications of the Dmt-Tic motif: a new class of dipeptide analogues showing altered pharmacological profiles toward the opioid receptors. J Med Chem44:2387-90 (2001) Delta-type opioid receptor
Name:Delta-type opioid receptor
Type:G Protein-Coupled Receptor (GPCR)
Mol. Mass.:40382.98
Organism:Homo sapiens (Human)
Description:Competition binding assays were carried out using membrane preparations from transfected HN9.10 cells that constitutively expressed the delta opioid receptor.
Residue:372
BDBM50101623
NameBDBM50101623
Synonyms:(4-Hydroxy-2,6-dimethyl-phenyl)-[(1,2,3,4-tetrahydro-isoquinoline-3-carbonyl)-amino]-acetic acid | CHEMBL416788
TypeSmall organic molecule
Emp. Form.C20H22N2O4
Mol. Mass.354.3997
SMILESCc1cc(O)cc(C)c1C(NC(=O)C1Cc2ccccc2CN1)C(O)=O