Reaction Details
TargetKappa-type opioid receptor
LigandBDBM50101624
Substrate/Competitorn/a
Meas. Tech.ChEMBL_147230 (CHEMBL754918)
EC50 6.9±n/a nM
Citation Pagé, DNaismith, ASchmidt, RCoupal, MLabarre, MGosselin, MBellemare, DPayza, KBrown, W Novel C-terminus modifications of the Dmt-Tic motif: a new class of dipeptide analogues showing altered pharmacological profiles toward the opioid receptors. J Med Chem44:2387-90 (2001) Kappa-type opioid receptor
Name:Kappa-type opioid receptor
Type:G Protein-Coupled Receptor (GPCR)
Mol. Mass.:42648.76
Organism:Homo sapiens (Human)
Description:P41145
Residue:380
BDBM50101624
NameBDBM50101624
Synonyms:1-{2-[2-Amino-3-(4-hydroxy-2,6-dimethyl-phenyl)-propionyl]-1,2,3,4-tetrahydro-isoquinolin-3-ylmethyl}-3-tert-butyl-urea | CHEMBL310842
TypeSmall organic molecule
Emp. Form.C26H36N4O3
Mol. Mass.452.589
SMILESCc1cc(O)cc(C)c1C[C@H](N)C(=O)N1Cc2ccccc2C[C@H]1CNC(=O)NC(C)(C)C