Reaction Details
TargetMu-type opioid receptor
LigandBDBM50101611
Substrate/Competitorn/a
Meas. Tech.ChEMBL_149485 (CHEMBL758076)
IC50 3±n/a nM
Citation Pagé, DNaismith, ASchmidt, RCoupal, MLabarre, MGosselin, MBellemare, DPayza, KBrown, W Novel C-terminus modifications of the Dmt-Tic motif: a new class of dipeptide analogues showing altered pharmacological profiles toward the opioid receptors. J Med Chem44:2387-90 (2001) Mu-type opioid receptor
Name:Mu-type opioid receptor
Type:G Protein-Coupled Receptor (GPCR)
Mol. Mass.:44789.51
Organism:Homo sapiens (Human)
Description:P35372
Residue:400
BDBM50101611
NameBDBM50101611
Synonyms:2-Amino-3-(4-hydroxy-2,6-dimethyl-phenyl)-1-(3-methyl-3,4-dihydro-1H-isoquinolin-2-yl)-propan-1-one | CHEMBL77196
TypeSmall organic molecule
Emp. Form.C21H26N2O2
Mol. Mass.338.4433
SMILESC[C@@H]1Cc2ccccc2CN1C(=O)[C@@H](N)Cc1c(C)cc(O)cc1C