Reaction Details
TargetKappa-type opioid receptor
LigandBDBM50101623
Substrate/Competitorn/a
Meas. Tech.ChEMBL_147230 (CHEMBL754918)
IC50 37500±n/a nM
Citation Pagé, DNaismith, ASchmidt, RCoupal, MLabarre, MGosselin, MBellemare, DPayza, KBrown, W Novel C-terminus modifications of the Dmt-Tic motif: a new class of dipeptide analogues showing altered pharmacological profiles toward the opioid receptors. J Med Chem44:2387-90 (2001) Kappa-type opioid receptor
Name:Kappa-type opioid receptor
Type:G Protein-Coupled Receptor (GPCR)
Mol. Mass.:42648.76
Organism:Homo sapiens (Human)
Description:P41145
Residue:380
BDBM50101623
NameBDBM50101623
Synonyms:(4-Hydroxy-2,6-dimethyl-phenyl)-[(1,2,3,4-tetrahydro-isoquinoline-3-carbonyl)-amino]-acetic acid | CHEMBL416788
TypeSmall organic molecule
Emp. Form.C20H22N2O4
Mol. Mass.354.3997
SMILESCc1cc(O)cc(C)c1C(NC(=O)C1Cc2ccccc2CN1)C(O)=O