Reaction Details
TargetMu-type opioid receptor
LigandBDBM50101628
Substrate/Competitorn/a
Meas. Tech.ChEMBL_149485 (CHEMBL758076)
IC50 0.650000±n/a nM
Citation Pagé, DNaismith, ASchmidt, RCoupal, MLabarre, MGosselin, MBellemare, DPayza, KBrown, W Novel C-terminus modifications of the Dmt-Tic motif: a new class of dipeptide analogues showing altered pharmacological profiles toward the opioid receptors. J Med Chem44:2387-90 (2001) Mu-type opioid receptor
Name:Mu-type opioid receptor
Type:G Protein-Coupled Receptor (GPCR)
Mol. Mass.:44789.51
Organism:Homo sapiens (Human)
Description:P35372
Residue:400
BDBM50101628
NameBDBM50101628
Synonyms:2-Amino-1-[3-(benzylamino-methyl)-3,4-dihydro-1H-isoquinolin-2-yl]-3-(4-hydroxy-2,6-dimethyl-phenyl)-propan-1-one | CHEMBL77001
TypeSmall organic molecule
Emp. Form.C28H33N3O2
Mol. Mass.443.5805
SMILESCc1cc(O)cc(C)c1C[C@H](N)C(=O)N1Cc2ccccc2C[C@H]1CNCc1ccccc1