Reaction Details
TargetAlpha-1B adrenergic receptor
LigandBDBM50101654
Substrate/Competitorn/a
Meas. Tech.ChEMBL_216132 (CHEMBL816952)
Ki 0.75±n/a nM
Citation Barlocco, DCignarella, GPiaz, VDGiovannoni, MPDe Benedetti, PGFanelli, FMontesano, FPoggesi, ELeonardi, A Phenylpiperazinylalkylamino substituted pyridazinones as potent alpha(1) adrenoceptor antagonists. J Med Chem44:2403-10 (2001) Alpha-1B adrenergic receptor
Name:Alpha-1B adrenergic receptor
Type:Enzyme
Mol. Mass.:56862.13
Organism:Homo sapiens (Human)
Description:P35368
Residue:520
BDBM50101654
NameBDBM50101654
Synonyms:5-Acetyl-4-{2-[4-(2-chloro-phenyl)-piperazin-1-yl]-ethylamino}-2-methyl-6-phenyl-2H-pyridazin-3-one | CHEMBL310599
TypeSmall organic molecule
Emp. Form.C25H28ClN5O2
Mol. Mass.465.975
SMILESCC(=O)c1c(NCCN2CCN(CC2)c2ccccc2Cl)c(=O)n(C)nc1-c1ccccc1