Reaction Details
TargetIntegrin alpha-IIb/beta-3
LigandBDBM50101751
Substrate/Competitorn/a
Meas. Tech.ChEMBL_215975 (CHEMBL821004)
IC50 500±n/a nM
Citation Peyman, AScheunemann, KWill, DWKnolle, JWehner, VBreipohl, GStilz, HUCarniato, DRuxer, JGourvest, JAuberval, MDoucet, BBaron, RGaillard, MGadek, TRBodary, S alpha(v)beta(3) Antagonists based on a central thiophene scaffold. Bioorg Med Chem Lett11:2011-5 (2001) Integrin alpha-IIb/beta-3
Name:Integrin alpha-IIb/beta-3
Synonyms:Glycoprotein IIb/IIIa
Type:n/a
Mol. Mass.:n/a
Description:ASSAY_ID of EBI is 30109
Components:This complex has 2 components.
Component 1
Name:Integrin beta-3
Type:Protein
Mol. Mass.:87038.91
Organism:Homo sapiens (Human)
Description:P05106
Residue:788
Component 2
Name:Integrin alpha-IIb
Synonyms:CD_antigen=CD41 GPIIb Glycoprotein IIb ITGA2B Integrin alpha-IIb heavy chain Integrin alpha-IIb light chain, form 2 Integrin alpha-V/beta-3 and alpha-IIb/beta 3 | Platelet membrane glycoprotein IIb
Type:Protein
Mol. Mass.:113354.85
Organism:Homo sapiens (Human)
Description:P08514
Residue:1039
BDBM50101751
NameBDBM50101751
Synonyms:(S)-3-({5-[2-(1,4,5,6-Tetrahydro-pyrimidin-2-ylcarbamoyl)-ethyl]-thiophene-2-carbonyl}-amino)-2-(2,2,2-trifluoro-ethanesulfonylamino)-propionic acid | CHEMBL61155
TypeSmall organic molecule
Emp. Form.C17H22F3N5O6S2
Mol. Mass.513.512
SMILESOC(=O)[C@H](CNC(=O)c1ccc(CCC(=O)NC2=NCCCN2)s1)NS(=O)(=O)CC(F)(F)F