Reaction Details
TargetIntegrin alpha-V/beta-3
LigandBDBM50101773
Substrate/Competitorn/a
Meas. Tech.ChEMBL_214621 (CHEMBL819701)
IC50 13±n/a nM
Citation Peyman, AScheunemann, KWill, DWKnolle, JWehner, VBreipohl, GStilz, HUCarniato, DRuxer, JGourvest, JAuberval, MDoucet, BBaron, RGaillard, MGadek, TRBodary, S alpha(v)beta(3) Antagonists based on a central thiophene scaffold. Bioorg Med Chem Lett11:2011-5 (2001) Integrin alpha-V/beta-3
Name:Integrin alpha-V/beta-3
Type:Enzyme
Mol. Mass.:n/a
Description:n/a
Components:This complex has 2 components.
Component 1
Name:Integrin alpha-V
Synonyms:ITAV_HUMAN Integrin alpha-V/alpha-5 VNRA Vitronectin receptor | Vitronectin receptor subunit alpha
Type:PROTEIN
Mol. Mass.:116024.92
Organism:Homo sapiens (Human)
Description:ChEMBL_582336
Residue:1048
Component 2
Name:Integrin beta-3
Synonyms:CD_antigen=CD61 GPIIIa ITGB3 Platelet membrane glycoprotein IIIa
Type:Protein
Mol. Mass.:87038.91
Organism:Homo sapiens (Human)
Description:P05106
Residue:788
BDBM50101773
NameBDBM50101773
Synonyms:(S)-2-(Naphthalene-1-sulfonylamino)-3-({5-[2-(1,4,5,6-tetrahydro-pyrimidin-2-ylcarbamoyl)-ethyl]-thiophene-2-carbonyl}-amino)-propionic acid | CHEMBL61011
TypeSmall organic molecule
Emp. Form.C25H27N5O6S2
Mol. Mass.557.642
SMILESOC(=O)[C@H](CNC(=O)c1ccc(CCC(=O)NC2=NCCCN2)s1)NS(=O)(=O)c1cccc2ccccc12