Reaction Details
TargetIntegrin alpha-V/beta-3
LigandBDBM50101774
Substrate/Competitorn/a
Meas. Tech.ChEMBL_214621 (CHEMBL819701)
IC50 10500±n/a nM
Citation Peyman, AScheunemann, KWill, DWKnolle, JWehner, VBreipohl, GStilz, HUCarniato, DRuxer, JGourvest, JAuberval, MDoucet, BBaron, RGaillard, MGadek, TRBodary, S alpha(v)beta(3) Antagonists based on a central thiophene scaffold. Bioorg Med Chem Lett11:2011-5 (2001) Integrin alpha-V/beta-3
Name:Integrin alpha-V/beta-3
Type:Enzyme
Mol. Mass.:n/a
Description:n/a
Components:This complex has 2 components.
Component 1
Name:Integrin alpha-V
Synonyms:ITAV_HUMAN Integrin alpha-V/alpha-5 VNRA Vitronectin receptor | Vitronectin receptor subunit alpha
Type:PROTEIN
Mol. Mass.:116024.92
Organism:Homo sapiens (Human)
Description:ChEMBL_582336
Residue:1048
Component 2
Name:Integrin beta-3
Synonyms:CD_antigen=CD61 GPIIIa ITGB3 Platelet membrane glycoprotein IIIa
Type:Protein
Mol. Mass.:87038.91
Organism:Homo sapiens (Human)
Description:P05106
Residue:788
BDBM50101774
NameBDBM50101774
Synonyms:3-Biphenyl-4-yl-3-{[5-(3-guanidino-3-oxo-propyl)-thiophene-2-carbonyl]-amino}-propionic acid | CHEMBL60480
TypeSmall organic molecule
Emp. Form.C27H28N4O4S
Mol. Mass.504.601
SMILESOC(=O)CC(NC(=O)c1ccc(CCC(=O)NC2=NCCCN2)s1)c1ccc(cc1)-c1ccccc1