Reaction Details
TargetIntegrin alpha-V/beta-3
LigandBDBM50101776
Substrate/Competitorn/a
Meas. Tech.ChEMBL_214766 (CHEMBL816224)
IC50 32±n/a nM
Citation Peyman, AScheunemann, KWill, DWKnolle, JWehner, VBreipohl, GStilz, HUCarniato, DRuxer, JGourvest, JAuberval, MDoucet, BBaron, RGaillard, MGadek, TRBodary, S alpha(v)beta(3) Antagonists based on a central thiophene scaffold. Bioorg Med Chem Lett11:2011-5 (2001) Integrin alpha-V/beta-3
Name:Integrin alpha-V/beta-3
Type:Enzyme
Mol. Mass.:n/a
Description:n/a
Components:This complex has 2 components.
Component 1
Name:Integrin alpha-V
Synonyms:ITAV_HUMAN Integrin alpha-V/alpha-5 VNRA Vitronectin receptor | Vitronectin receptor subunit alpha
Type:PROTEIN
Mol. Mass.:116024.92
Organism:Homo sapiens (Human)
Description:ChEMBL_582336
Residue:1048
Component 2
Name:Integrin beta-3
Synonyms:CD_antigen=CD61 GPIIIa ITGB3 Platelet membrane glycoprotein IIIa
Type:Protein
Mol. Mass.:87038.91
Organism:Homo sapiens (Human)
Description:P05106
Residue:788
BDBM50101776
NameBDBM50101776
Synonyms:3-Benzo[1,3]dioxol-5-yl-3-({5-[(E)-2-(1,4,5,6-tetrahydro-pyrimidin-2-ylcarbamoyl)-vinyl]-thiophene-2-carbonyl}-amino)-propionic acid | CHEMBL432687
TypeSmall organic molecule
Emp. Form.C19H18N4O6S
Mol. Mass.430.434
SMILESNC(=N)NC(=O)\C=C\c1ccc(s1)C(=O)NC(CC(O)=O)c1ccc2OCOc2c1