Reaction Details
TargetAdenosine receptor A1
LigandBDBM50101783
Substrate/Competitorn/a
Meas. Tech.ChEBML_29638
Ki 33±n/a nM
Citation van Tilburg, EWvan der Klein, PAde Groote, MBeukers, MWIJzerman, AP Substituted 4-phenyl-2-(phenylcarboxamido)-1,3-thiazole derivatives as antagonists for the adenosine A(1) receptor. Bioorg Med Chem Lett11:2017-9 (2001) Adenosine receptor A1
Name:Adenosine receptor A1
Type:Protein
Mol. Mass.:36704.13
Organism:Rattus norvegicus (rat)
Description:n/a
Residue:326
BDBM50101783
NameBDBM50101783
Synonyms:4-Bromo-N-(4-phenyl-thiazol-2-yl)-benzamide | CHEMBL61836
TypeSmall organic molecule
Emp. Form.C16H11BrN2OS
Mol. Mass.359.24
SMILESBrc1ccc(cc1)C(=O)Nc1nc(cs1)-c1ccccc1