Reaction Details
TargetAdenosine receptor A1
LigandBDBM50097446
Substrate/Competitorn/a
Meas. Tech.ChEBML_29638
Ki 3000±n/a nM
Citation van Tilburg, EWvan der Klein, PAde Groote, MBeukers, MWIJzerman, AP Substituted 4-phenyl-2-(phenylcarboxamido)-1,3-thiazole derivatives as antagonists for the adenosine A(1) receptor. Bioorg Med Chem Lett11:2017-9 (2001) Adenosine receptor A1
Name:Adenosine receptor A1
Type:Protein
Mol. Mass.:36704.13
Organism:Rattus norvegicus (rat)
Description:n/a
Residue:326
BDBM50097446
NameBDBM50097446
Synonyms:4-Methoxy-N-(3-phenyl-isoquinolin-1-yl)-benzamide | CHEMBL62075
TypeSmall organic molecule
Emp. Form.C23H18N2O2
Mol. Mass.354.4012
SMILESCOc1ccc(cc1)C(=O)Nc1nc(cc2ccccc12)-c1ccccc1