Reaction Details
TargetAdenosine receptor A3
LigandBDBM50097423
Substrate/Competitorn/a
Meas. Tech.ChEBML_29903
Ki 82±n/a nM
Citation van Tilburg, EWvan der Klein, PAde Groote, MBeukers, MWIJzerman, AP Substituted 4-phenyl-2-(phenylcarboxamido)-1,3-thiazole derivatives as antagonists for the adenosine A(1) receptor. Bioorg Med Chem Lett11:2017-9 (2001) Adenosine receptor A3
Name:Adenosine receptor A3
Type:G Protein-Coupled Receptor (GPCR)
Mol. Mass.:36197.32
Organism:Homo sapiens (Human)
Description:P0DMS8
Residue:318
BDBM50097423
NameBDBM50097423
Synonyms:4-Methoxy-N-(3-phenyl-[1,2,4]thiadiazol-5-yl)-benzamide 4-methoxy-N-(3-phenyl-1,2,4-thiadiazol-5-yl)benzamide LUF-5417
TypeSmall organic molecule
Emp. Form.C16H13N3O2S
Mol. Mass.311.358
SMILESCOc1ccc(cc1)C(=O)Nc1nc(ns1)-c1ccccc1