Reaction Details
TargetProstaglandin E2 receptor EP2 subtype
LigandBDBM50101825
Substrate/Competitorn/a
Meas. Tech.ChEMBL_158307 (CHEMBL763192)
EC50>10000±n/a nM
Citation Tani, KNaganawa, AIshida, AEgashira, HSagawa, KHarada, HOgawa, MMaruyama, TOhuchida, SNakai, HKondo, KToda, M Design and synthesis of a highly selective EP2-receptor agonist. Bioorg Med Chem Lett11:2025-8 (2001) Prostaglandin E2 receptor EP2 subtype
Name:Prostaglandin E2 receptor EP2 subtype
Type:G-protein coupled receptor
Mol. Mass.:40495.26
Organism:Mus musculus (Mouse)
Description:n/a
Residue:362
BDBM50101825
NameBDBM50101825
Synonyms:(Z)-7-{(1R,2R,3R)-3-Hydroxy-2-[(E)-(S)-4-hydroxy-4-(1-propyl-cyclohexyl)-but-1-enyl]-5-oxo-cyclopentyl}-hept-5-enoic acid | CHEMBL62987
TypeSmall organic molecule
Emp. Form.C25H40O5
Mol. Mass.420.5821
SMILESCCCC1(CCCCC1)[C@@H](O)C\C=C\[C@H]1[C@H](O)CC(=O)[C@@H]1C\C=C/CCCC(O)=O