Reaction Details
TargetProstacyclin receptor
LigandBDBM50101827
Substrate/Competitorn/a
Meas. Tech.ChEBML_158461
Ki>10000±n/a nM
Citation Tani, KNaganawa, AIshida, AEgashira, HSagawa, KHarada, HOgawa, MMaruyama, TOhuchida, SNakai, HKondo, KToda, M Design and synthesis of a highly selective EP2-receptor agonist. Bioorg Med Chem Lett11:2025-8 (2001) Prostacyclin receptor
Name:Prostacyclin receptor
Type:G Protein-Coupled Receptor (GPCR)
Mol. Mass.:40968.22
Organism:Homo sapiens (Human)
Description:The membranes prepared from human platelet were used in binding assay.
Residue:386
BDBM50101827
NameBDBM50101827
Synonyms:(Z)-7-{(1R,2R,3R)-2-[(E)-(S)-4-(1-Ethyl-cyclobutyl)-4-hydroxy-but-1-enyl]-3-hydroxy-5-oxo-cyclopentyl}-hept-5-enoic acid | CHEMBL64483
TypeSmall organic molecule
Emp. Form.C22H34O5
Mol. Mass.378.5024
SMILESCCC1(CCC1)[C@@H](O)C\C=C\[C@H]1[C@H](O)CC(=O)[C@@H]1C\C=C/CCCC(O)=O