Reaction Details
TargetProstaglandin E2 receptor EP1 subtype
LigandBDBM50101823
Substrate/Competitorn/a
Meas. Tech.ChEBML_158179
Ki>10000±n/a nM
Citation Tani, KNaganawa, AIshida, AEgashira, HSagawa, KHarada, HOgawa, MMaruyama, TOhuchida, SNakai, HKondo, KToda, M Design and synthesis of a highly selective EP2-receptor agonist. Bioorg Med Chem Lett11:2025-8 (2001) Prostaglandin E2 receptor EP1 subtype
Name:Prostaglandin E2 receptor EP1 subtype
Type:G-protein coupled receptor
Mol. Mass.:43000.62
Organism:Mus musculus (Mouse)
Description:n/a
Residue:405
BDBM50101823
NameBDBM50101823
Synonyms:4-(2-{(1R,3R)-3-Hydroxy-2-[(E)-(S)-4-hydroxy-4-(1-propyl-cyclobutyl)-but-1-enyl]-5-oxo-cyclopentyl}-ethyl)-benzoic acid | CHEMBL64423
TypeSmall organic molecule
Emp. Form.C25H34O5
Mol. Mass.414.5345
SMILESCCCC1(CCC1)[C@@H](O)C\C=C\C1[C@H](O)CC(=O)[C@@H]1CCc1ccc(cc1)C(O)=O