Reaction Details
TargetProstaglandin E2 receptor EP4 subtype
LigandBDBM50101853
Substrate/Competitorn/a
Meas. Tech.ChEBML_158451
Ki 3.1±n/a nM
Citation Maruyama, TAsada, MShiraishi, TSakata, KSeki, AYoshida, HShinagawa, YMaruyama, TOhuchida, SNakai, HKondo, KToda, M Design and synthesis of a highly selective EP4-receptor agonist. Part 2: 5-thia and 9beta-haloPG derivatives with improved stability. Bioorg Med Chem Lett11:2033-5 (2001) Prostaglandin E2 receptor EP4 subtype
Name:Prostaglandin E2 receptor EP4 subtype
Type:G-protein coupled receptor
Mol. Mass.:56175.66
Organism:Mus musculus (Mouse)
Description:n/a
Residue:513
BDBM50101853
NameBDBM50101853
Synonyms:(11alpha,13E,15S)-11,15-dihydroxy-9-oxoprost-13-en-1-oic acid 11alpha,15alpha-dihydroxy-9-oxo-13-trans-prostenoic acid CHEMBL495 PGE1 | prostaglandin E1
TypeSmall organic molecule
Emp. Form.C20H34O5
Mol. Mass.354.481
SMILESCCCCC[C@H](O)\C=C\[C@H]1[C@H](O)CC(=O)[C@@H]1CCCCCCC(O)=O