Reaction Details
TargetProstaglandin E2 receptor EP3 subtype
LigandBDBM50101863
Substrate/Competitorn/a
Meas. Tech.ChEBML_158325
Ki 3.7±n/a nM
Citation Maruyama, TAsada, MShiraishi, TSakata, KSeki, AYoshida, HShinagawa, YMaruyama, TOhuchida, SNakai, HKondo, KToda, M Design and synthesis of a highly selective EP4-receptor agonist. Part 2: 5-thia and 9beta-haloPG derivatives with improved stability. Bioorg Med Chem Lett11:2033-5 (2001) Prostaglandin E2 receptor EP3 subtype
Name:Prostaglandin E2 receptor EP3 subtype
Type:G-protein coupled receptor
Mol. Mass.:40092.50
Organism:Mus musculus (Mouse)
Description:n/a
Residue:365
BDBM50101863
NameBDBM50101863
Synonyms:3-{(S)-3-[(R)-3-Hydroxy-2-((1R,2R)-3-hydroxy-oct-1-enyl)-5-oxo-cyclopentyl]-propylsulfanyl}-propionic acid | CHEMBL62868
TypeSmall organic molecule
Emp. Form.C19H32O5S
Mol. Mass.372.519
SMILESCCCCC[C@H](O)\C=C\[C@H]1[C@H](O)CC(=O)[C@@H]1CCCSCCC(O)=O