Reaction Details
TargetCoagulation factor X
LigandBDBM50101870
Substrate/Competitorn/a
Meas. Tech.ChEBML_48813
Ki 4±n/a nM
Citation Rai, RKolesnikov, ALi, YYoung, WBLeahy, ESprengeler, PAVerner, EShrader, WDBurgess-Henry, JSangalang, JCAllen, DChen, XKatz, BALuong, CElrod, KCregar, L Development of potent and selective factor Xa inhibitors. Bioorg Med Chem Lett11:1797-800 (2001) Coagulation factor X
Name:Coagulation factor X
Type:Enzyme
Mol. Mass.:54726.60
Organism:Homo sapiens (Human)
Description:n/a
Residue:488
BDBM50101870
NameBDBM50101870
Synonyms:3-(3-Benzyl-5-carbamimidoyl-1H-indol-2-yl)-5-bromo-4-hydroxy-benzoic acid | CHEMBL417020
TypeSmall organic molecule
Emp. Form.C23H18BrN3O3
Mol. Mass.464.311
SMILESNC(=N)c1ccc2[nH]c(c(Cc3ccccc3)c2c1)-c1cc(cc(Br)c1O)C(O)=O