Reaction Details
TargetEstrogen receptor beta
LigandBDBM50102195
Substrate/Competitorn/a
Meas. Tech.ChEBML_67823
Ki 1000±n/a nM
Citation Henke, BRDrewry, DHJones, SAStewart, ELWeaver, SLWiethe, RW 2-Amino-4,6-diarylpyridines as novel ligands for the estrogen receptor. Bioorg Med Chem Lett11:1939-42 (2001) Estrogen receptor beta
Name:Estrogen receptor beta
Type:Protein
Mol. Mass.:59238.43
Organism:Homo sapiens (Human)
Description:Q92731
Residue:530
BDBM50102195
NameBDBM50102195
Synonyms:4-[6-(Ethyl-pyridin-4-ylmethyl-amino)-4-phenyl-pyridin-2-yl]-2-methyl-phenol | CHEMBL61026
TypeSmall organic molecule
Emp. Form.C26H25N3O
Mol. Mass.395.4962
SMILESCCN(Cc1ccncc1)c1cc(cc(n1)-c1ccc(O)c(C)c1)-c1ccccc1