Reaction Details
TargetEstrogen receptor beta
LigandBDBM50102192
Substrate/Competitorn/a
Meas. Tech.ChEBML_67823
Ki>3000±n/a nM
Citation Henke, BRDrewry, DHJones, SAStewart, ELWeaver, SLWiethe, RW 2-Amino-4,6-diarylpyridines as novel ligands for the estrogen receptor. Bioorg Med Chem Lett11:1939-42 (2001) Estrogen receptor beta
Name:Estrogen receptor beta
Type:Protein
Mol. Mass.:59238.43
Organism:Homo sapiens (Human)
Description:Q92731
Residue:530
BDBM50102192
NameBDBM50102192
Synonyms:4-[4-(4-hydroxyphenyl)-6-methyl(phenethyl)amino-2-pyridyl]phenol | CHEMBL58741
TypeSmall organic molecule
Emp. Form.C26H24N2O2
Mol. Mass.396.481
SMILESCN(CCc1ccccc1)c1cc(cc(n1)-c1ccc(O)cc1)-c1ccc(O)cc1