Reaction Details
TargetEstrogen receptor beta
LigandBDBM50102196
Substrate/Competitorn/a
Meas. Tech.ChEBML_67823
Ki 1260±n/a nM
Citation Henke, BRDrewry, DHJones, SAStewart, ELWeaver, SLWiethe, RW 2-Amino-4,6-diarylpyridines as novel ligands for the estrogen receptor. Bioorg Med Chem Lett11:1939-42 (2001) Estrogen receptor beta
Name:Estrogen receptor beta
Type:Protein
Mol. Mass.:59238.43
Organism:Homo sapiens (Human)
Description:Q92731
Residue:530
BDBM50102196
NameBDBM50102196
Synonyms:4-[6-(Isobutyl-methyl-amino)-4-phenyl-pyridin-2-yl]-phenol | CHEMBL59552
TypeSmall organic molecule
Emp. Form.C22H24N2O
Mol. Mass.332.4388
SMILESCC(C)CN(C)c1cc(cc(n1)-c1ccc(O)cc1)-c1ccccc1