Reaction Details
TargetC-X-C chemokine receptor type 2
LigandBDBM50102214
Substrate/Competitorn/a
Meas. Tech.ChEBML_39662
IC50>20000±n/a nM
Citation Cutshall, NSUrsino, RKucera, KALatham, JIhle, NC Nicotinamide N-oxides as CXCR2 antagonists. Bioorg Med Chem Lett11:1951-4 (2001) C-X-C chemokine receptor type 2
Name:C-X-C chemokine receptor type 2
Type:Protein
Mol. Mass.:40767.88
Organism:Homo sapiens (Human)
Description:P25025
Residue:360
BDBM50102214
NameBDBM50102214
Synonyms:6-Chloro-N-(4-fluoro-benzyl)-1-oxy-nicotinamide | CHEMBL59734
TypeSmall organic molecule
Emp. Form.C13H10ClFN2O2
Mol. Mass.280.682
SMILES[O-][n+]1cc(ccc1Cl)C(=O)NCc1ccc(F)cc1