Reaction Details
TargetC-X-C chemokine receptor type 2
LigandBDBM50102215
Substrate/Competitorn/a
Meas. Tech.ChEBML_39662
IC50>20000±n/a nM
Citation Cutshall, NSUrsino, RKucera, KALatham, JIhle, NC Nicotinamide N-oxides as CXCR2 antagonists. Bioorg Med Chem Lett11:1951-4 (2001) C-X-C chemokine receptor type 2
Name:C-X-C chemokine receptor type 2
Type:Protein
Mol. Mass.:40767.88
Organism:Homo sapiens (Human)
Description:P25025
Residue:360
BDBM50102215
NameBDBM50102215
Synonyms:6-Chloro-N-(2-hydroxy-phenyl)-1-oxy-nicotinamide | CHEMBL292767
TypeSmall organic molecule
Emp. Form.C12H9ClN2O3
Mol. Mass.264.664
SMILESOc1ccccc1NC(=O)c1ccc(Cl)[n+]([O-])c1