Reaction Details
TargetC-X-C chemokine receptor type 2
LigandBDBM50102229
Substrate/Competitorn/a
Meas. Tech.ChEBML_39662
IC50 90±n/a nM
Citation Cutshall, NSUrsino, RKucera, KALatham, JIhle, NC Nicotinamide N-oxides as CXCR2 antagonists. Bioorg Med Chem Lett11:1951-4 (2001) C-X-C chemokine receptor type 2
Name:C-X-C chemokine receptor type 2
Type:Protein
Mol. Mass.:40767.88
Organism:Homo sapiens (Human)
Description:P25025
Residue:360
BDBM50102229
NameBDBM50102229
Synonyms:6-Benzenesulfonyl-N-(4-fluoro-phenyl)-1-oxy-nicotinamide | CHEMBL301424
TypeSmall organic molecule
Emp. Form.C18H13FN2O4S
Mol. Mass.372.37
SMILES[O-][n+]1cc(ccc1S(=O)(=O)c1ccccc1)C(=O)Nc1ccc(F)cc1