Reaction Details
TargetC-X-C chemokine receptor type 2
LigandBDBM50102228
Substrate/Competitorn/a
Meas. Tech.ChEBML_39662
IC50>20000±n/a nM
Citation Cutshall, NSUrsino, RKucera, KALatham, JIhle, NC Nicotinamide N-oxides as CXCR2 antagonists. Bioorg Med Chem Lett11:1951-4 (2001) C-X-C chemokine receptor type 2
Name:C-X-C chemokine receptor type 2
Type:Protein
Mol. Mass.:40767.88
Organism:Homo sapiens (Human)
Description:P25025
Residue:360
BDBM50102228
NameBDBM50102228
Synonyms:CHEMBL60578 | N-Benzhydryl-6-chloro-1-oxy-nicotinamide
TypeSmall organic molecule
Emp. Form.C19H15ClN2O2
Mol. Mass.338.788
SMILES[O-][n+]1cc(ccc1Cl)C(=O)NC(c1ccccc1)c1ccccc1