Reaction Details
TargetAlpha-1A adrenergic receptor
LigandBDBM50102246
Substrate/Competitorn/a
Meas. Tech.ChEBML_33742
Ki 2±n/a nM
Citation DiPardo, RMPatane, MANewton, RCPrice, RBroten, TPChang, RSRansom, RWDi Salvo, JFreidinger, RMBock, MG Cyclic imides as potent and selective alpha-1A adrenergic receptor antagonists. Bioorg Med Chem Lett11:1959-62 (2001) Alpha-1A adrenergic receptor
Name:Alpha-1A adrenergic receptor
Type:Cell-surface receptors
Mol. Mass.:51511.67
Organism:Homo sapiens (Human)
Description:P35348
Residue:466
BDBM50102246
NameBDBM50102246
Synonyms:CHEMBL59590 | N-[3-(4-Cyano-4-o-tolyl-piperidin-1-yl)-propyl]-2-hydroxy-2,2-di-p-tolyl-acetamide
TypeSmall organic molecule
Emp. Form.C32H37N3O2
Mol. Mass.495.6551
SMILESCc1ccc(cc1)C(O)(C(=O)NCCCN1CCC(CC1)(C#N)c1ccccc1C)c1ccc(C)cc1