Reaction Details
TargetP2X purinoceptor 1
LigandBDBM50102296
Substrate/Competitorn/a
Meas. Tech.ChEMBL_147547 (CHEMBL754874)
IC50 37±n/a nM
Citation Kim, YCBrown, SGHarden, TKBoyer, JLDubyak, GKing, BFBurnstock, GJacobson, KA Structure-activity relationships of pyridoxal phosphate derivatives as potent and selective antagonists of P2X1 receptors. J Med Chem44:340-9 (2001) P2X purinoceptor 1
Name:P2X purinoceptor 1
Type:Enzyme Catalytic Domain
Mol. Mass.:44969.95
Organism:RAT
Description:Purinergic, P2X1 0 RAT::P47824
Residue:399
BDBM50102296
NameBDBM50102296
Synonyms:2-(4-Formyl-5-hydroxy-6-methyl-3-phosphonomethyl-pyridin-2-ylazo)-terephthalic acid | CHEMBL331358
TypeSmall organic molecule
Emp. Form.C16H14N3O9P
Mol. Mass.423.2708
SMILESCc1nc(N=Nc2cc(ccc2C(O)=O)C(O)=O)c(CP(O)(O)=O)c(C=O)c1O