Reaction Details
TargetDihydrofolate reductase
LigandBDBM18512
Substrate/Competitorn/a
Meas. Tech.ChEBML_54973
IC50 2300±n/a nM
Citation Chan, DCLaughton, CAQueener, SFStevens, MF Structural studies on bioactive compounds. 34. Design, synthesis, and biological evaluation of triazenyl-substituted pyrimethamine inhibitors of Pneumocystis carinii dihydrofolate reductase. J Med Chem44:2555-64 (2001) Dihydrofolate reductase
Name:Dihydrofolate reductase
Type:Enzyme
Mol. Mass.:21638.84
Organism:Rattus norvegicus (rat)
Description:n/a
Residue:187
BDBM18512
NameBDBM18512
Synonyms:5-(4-chlorophenyl)-6-ethylpyrimidine-2,4-diamine Pyrimethamine (Pyr) cid_4993
TypeSmall organic molecule
Emp. Form.C12H13ClN4
Mol. Mass.248.711
SMILESCCc1nc(N)nc(N)c1-c1ccc(Cl)cc1