Reaction Details
TargetReceptor tyrosine-protein kinase erbB-2
LigandBDBM50102525
Substrate/Competitorn/a
Meas. Tech.ChEMBL_66880 (CHEMBL676071)
Kd 3560±n/a nM
Citation Berezov, AZhang, HTGreene, MIMurali, R Disabling erbB receptors with rationally designed exocyclic mimetics of antibodies: structure-function analysis. J Med Chem44:2565-74 (2001) Receptor tyrosine-protein kinase erbB-2
Name:Receptor tyrosine-protein kinase erbB-2
Type:n/a
Mol. Mass.:137894.47
Organism:Homo sapiens (Human)
Description:P04626
Residue:1255
BDBM50102525
NameBDBM50102525
Synonyms:CHEMBL265285 | FCDGFYACYMDV-OH
TypeSmall organic molecule
Emp. Form.C65H82N12O19S3
Mol. Mass.1431.611
SMILESCSCC[C@H](NC(=O)[C@H](Cc1ccc(O)cc1)NC(=O)[C@@H]1CSSC[C@H](NC(=O)[C@@H](N)Cc2ccccc2)C(=O)N[C@@H](CC(O)=O)C(=O)NCC(=O)N[C@@H](Cc2ccccc2)C(=O)N[C@@H](Cc2ccc(O)cc2)C(=O)N[C@@H](C)C(=O)N1)C(=O)N[C@@H](CC(O)=O)C(=O)N[C@@H](C(C)C)C(O)=O