Reaction Details
TargetTissue-type plasminogen activator
LigandBDBM50102791
Substrate/Competitorn/a
Meas. Tech.ChEMBL_225383 (CHEMBL847817)
Ki 280±n/a nM
Citation Verner, EKatz, BASpencer, JRAllen, DHataye, JHruzewicz, WHui, HCKolesnikov, ALi, YLuong, CMartelli, ARadika, KRai, RShe, MShrader, WSprengeler, PATrapp, SWang, JYoung, WBMackman, RL Development of serine protease inhibitors displaying a multicentered short (<2.3 A) hydrogen bond binding mode: inhibitors of urokinase-type plasminogen activator and factor Xa. J Med Chem44:2753-71 (2001) Tissue-type plasminogen activator
Name:Tissue-type plasminogen activator
Type:Enzyme
Mol. Mass.:62931.08
Organism:Homo sapiens (Human)
Description:n/a
Residue:562
BDBM50102791
NameBDBM50102791
Synonyms:2-(5-Chloro-2-hydroxy-biphenyl-3-yl)-1H-benzoimidazole-5-carboxamidine | CHEMBL92251
TypeSmall organic molecule
Emp. Form.C20H15ClN4O
Mol. Mass.362.812
SMILESNC(=N)c1ccc2nc([nH]c2c1)-c1cc(Cl)cc(-c2ccccc2)c1O