Reaction Details
Target5-hydroxytryptamine receptor 3A
LigandBDBM50103069
Substrate/Competitorn/a
Meas. Tech.ChEMBL_3480 (CHEMBL619058)
Ki 5.2±n/a nM
Citation Parihar, HSSuryanarayanan, AMa, CJoshi, PVenkataraman, PSchulte, MKKirschbaum, KS 5-HT(3)R binding of lerisetron: an interdisciplinary approach to drug-Receptor interactions. Bioorg Med Chem Lett11:2133-6 (2001) 5-hydroxytryptamine receptor 3A
Name:5-hydroxytryptamine receptor 3A
Type:Protein
Mol. Mass.:55283.27
Organism:Homo sapiens (Human)
Description:P46098
Residue:478
BDBM50103069
NameBDBM50103069
Synonyms:1-(4-Fluoro-benzyl)-2-piperazin-1-yl-1H-benzoimidazole | CHEMBL302743
TypeSmall organic molecule
Emp. Form.C18H19FN4
Mol. Mass.310.3687
SMILESFc1ccc(Cn2c(nc3ccccc23)N2CCNCC2)cc1