Reaction Details
Target5-hydroxytryptamine receptor 3A
LigandBDBM50103072
Substrate/Competitorn/a
Meas. Tech.ChEMBL_3480 (CHEMBL619058)
Ki 0.360000±n/a nM
Citation Parihar, HSSuryanarayanan, AMa, CJoshi, PVenkataraman, PSchulte, MKKirschbaum, KS 5-HT(3)R binding of lerisetron: an interdisciplinary approach to drug-Receptor interactions. Bioorg Med Chem Lett11:2133-6 (2001) 5-hydroxytryptamine receptor 3A
Name:5-hydroxytryptamine receptor 3A
Type:Protein
Mol. Mass.:55283.27
Organism:Homo sapiens (Human)
Description:P46098
Residue:478
BDBM50103072
NameBDBM50103072
Synonyms:1-Benzyl-2-piperazin-1-yl-1H-benzoimidazole Lerisetron
TypeSmall organic molecule
Emp. Form.C18H20N4
Mol. Mass.292.3782
SMILESC(c1ccccc1)n1c(nc2ccccc12)N1CCNCC1