Reaction Details
TargetMuscarinic acetylcholine receptor M2
LigandBDBM50103086
Substrate/Competitorn/a
Meas. Tech.ChEBML_138180
Ki>1400±n/a nM
Citation Tagat, JRMcCombie, SWSteensma, RWLin, SNazareno, DVBaroudy, BVantuno, NXu, SLiu, J Piperazine-based CCR5 antagonists as HIV-1 inhibitors. I: 2(S)-methyl piperazine as a key pharmacophore element. Bioorg Med Chem Lett11:2143-6 (2001) Muscarinic acetylcholine receptor M2
Name:Muscarinic acetylcholine receptor M2
Type:GPCR
Mol. Mass.:51730.61
Organism:Homo sapiens (Human)
Description:P08172
Residue:466
BDBM50103086
NameBDBM50103086
Synonyms:CHEMBL413972 | [4-((S)-4-{(S)-1-[4-(3-Chloro-benzyl)-phenyl]-ethyl}-3-methyl-piperazin-1-yl)-piperidin-1-yl]-(2,6-dimethyl-phenyl)-methanone
TypeSmall organic molecule
Emp. Form.C34H42ClN3O
Mol. Mass.544.17
SMILESC[C@H](N1CCN(C[C@@H]1C)C1CCN(CC1)C(=O)c1c(C)cccc1C)c1ccc(Cc2cccc(Cl)c2)cc1