Reaction Details
TargetC-C chemokine receptor type 5
LigandBDBM50103084
Substrate/Competitorn/a
Meas. Tech.ChEBML_39649
Ki 44±n/a nM
Citation Tagat, JRMcCombie, SWSteensma, RWLin, SNazareno, DVBaroudy, BVantuno, NXu, SLiu, J Piperazine-based CCR5 antagonists as HIV-1 inhibitors. I: 2(S)-methyl piperazine as a key pharmacophore element. Bioorg Med Chem Lett11:2143-6 (2001) C-C chemokine receptor type 5
Name:C-C chemokine receptor type 5
Type:Enzyme
Mol. Mass.:40540.21
Organism:Homo sapiens (Human)
Description:P51681
Residue:352
BDBM50103084
NameBDBM50103084
Synonyms:CHEMBL66623 | {4-[(S)-4-(4-Benzo[1,3]dioxol-5-ylmethyl-benzyl)-3-methyl-piperazin-1-yl]-piperidin-1-yl}-(2,6-dimethyl-phenyl)-methanone
TypeSmall organic molecule
Emp. Form.C34H41N3O3
Mol. Mass.539.7076
SMILESC[C@H]1CN(CCN1Cc1ccc(Cc2ccc3OCOc3c2)cc1)C1CCN(CC1)C(=O)c1c(C)cccc1C