Reaction Details
TargetInterstitial collagenase
LigandBDBM50103095
Substrate/Competitorn/a
Meas. Tech.ChEBML_105944
Ki 47±n/a nM
Citation Musso, DLAndersen, MWAndrews, RCAustin, RBeaudet, EJBecherer, JDBubacz, DGBickett, DMChan, JHConway, JGCowan, DJGaul, MDGlennon, KCHedeen, KMLambert, MHLeesnitzer, MAMcDougald, DLMitchell, JLMoss, MLRabinowitz, MHRizzolio, MCSchaller, LTStanford, JBTippin, TWarner, JRWhitesell, LGWiethe, RW N-hydroxyformamide peptidomimetics as TACE/matrix metalloprotease inhibitors: oral activity via P1' isobutyl substitution. Bioorg Med Chem Lett11:2147-51 (2001) Interstitial collagenase
Name:Interstitial collagenase
Type:Enzyme
Mol. Mass.:54010.26
Organism:Homo sapiens (Human)
Description: P03956
Residue:469
BDBM50103095
NameBDBM50103095
Synonyms:(2R,3S)-3-(Formyl-hydroxy-amino)-2-isobutyl-pentanoic acid [2,2-dimethyl-1-(pyridin-2-ylcarbamoyl)-propyl]-amide | CHEMBL307773
TypeSmall organic molecule
Emp. Form.C21H34N4O4
Mol. Mass.406.5191
SMILESCC[C@@H]([C@@H](CC(C)C)C(=O)N[C@H](C(=O)Nc1ccccn1)C(C)(C)C)N(O)C=O