Reaction Details
TargetStromelysin-1
LigandBDBM50103092
Substrate/Competitorn/a
Meas. Tech.ChEMBL_104569 (CHEMBL714852)
Ki 2323±n/a nM
Citation Musso, DLAndersen, MWAndrews, RCAustin, RBeaudet, EJBecherer, JDBubacz, DGBickett, DMChan, JHConway, JGCowan, DJGaul, MDGlennon, KCHedeen, KMLambert, MHLeesnitzer, MAMcDougald, DLMitchell, JLMoss, MLRabinowitz, MHRizzolio, MCSchaller, LTStanford, JBTippin, TWarner, JRWhitesell, LGWiethe, RW N-hydroxyformamide peptidomimetics as TACE/matrix metalloprotease inhibitors: oral activity via P1' isobutyl substitution. Bioorg Med Chem Lett11:2147-51 (2001) Stromelysin-1
Name:Stromelysin-1
Type:Enzyme
Mol. Mass.:53973.13
Organism:Homo sapiens (Human)
Description: P08254
Residue:477
BDBM50103092
NameBDBM50103092
Synonyms:(R)-2-[(S)-1-(Formyl-hydroxy-amino)-ethyl]-4-methyl-pentanoic acid (2,2-dimethyl-1-methylcarbamoyl-propyl)-amide | CHEMBL66970
TypeSmall organic molecule
Emp. Form.C16H31N3O4
Mol. Mass.329.435
SMILESCNC(=O)[C@@H](NC(=O)[C@H](CC(C)C)[C@H](C)N(O)C=O)C(C)(C)C