Reaction Details
TargetStromelysin-1
LigandBDBM50103102
Substrate/Competitorn/a
Meas. Tech.ChEMBL_104569 (CHEMBL714852)
Ki 120±n/a nM
Citation Musso, DLAndersen, MWAndrews, RCAustin, RBeaudet, EJBecherer, JDBubacz, DGBickett, DMChan, JHConway, JGCowan, DJGaul, MDGlennon, KCHedeen, KMLambert, MHLeesnitzer, MAMcDougald, DLMitchell, JLMoss, MLRabinowitz, MHRizzolio, MCSchaller, LTStanford, JBTippin, TWarner, JRWhitesell, LGWiethe, RW N-hydroxyformamide peptidomimetics as TACE/matrix metalloprotease inhibitors: oral activity via P1' isobutyl substitution. Bioorg Med Chem Lett11:2147-51 (2001) Stromelysin-1
Name:Stromelysin-1
Type:Enzyme
Mol. Mass.:53973.13
Organism:Homo sapiens (Human)
Description: P08254
Residue:477
BDBM50103102
NameBDBM50103102
Synonyms:(R)-2-[(S)-1-(Formyl-hydroxy-amino)-ethyl]-4-methyl-pentanoic acid [2-methyl-1-(thiazol-2-ylcarbamoyl)-propyl]-amide | CHEMBL302941
TypeSmall organic molecule
Emp. Form.C17H28N4O4S
Mol. Mass.384.494
SMILESCC(C)C[C@H]([C@H](C)N(O)C=O)C(=O)N[C@@H](C(C)C)C(=O)Nc1nccs1