Reaction Details
TargetInterstitial collagenase
LigandBDBM50103094
Substrate/Competitorn/a
Meas. Tech.ChEBML_105944
Ki 170±n/a nM
Citation Musso, DLAndersen, MWAndrews, RCAustin, RBeaudet, EJBecherer, JDBubacz, DGBickett, DMChan, JHConway, JGCowan, DJGaul, MDGlennon, KCHedeen, KMLambert, MHLeesnitzer, MAMcDougald, DLMitchell, JLMoss, MLRabinowitz, MHRizzolio, MCSchaller, LTStanford, JBTippin, TWarner, JRWhitesell, LGWiethe, RW N-hydroxyformamide peptidomimetics as TACE/matrix metalloprotease inhibitors: oral activity via P1' isobutyl substitution. Bioorg Med Chem Lett11:2147-51 (2001) Interstitial collagenase
Name:Interstitial collagenase
Type:Enzyme
Mol. Mass.:54010.26
Organism:Homo sapiens (Human)
Description: P03956
Residue:469
BDBM50103094
NameBDBM50103094
Synonyms:(R)-2-[(S)-1-(Formyl-hydroxy-amino)-ethyl]-4-methyl-pentanoic acid [3,3-dimethyl-1-(thiazol-2-ylcarbamoyl)-butyl]-amide | CHEMBL68812
TypeSmall organic molecule
Emp. Form.C19H32N4O4S
Mol. Mass.412.547
SMILESCC(C)C[C@H]([C@H](C)N(O)C=O)C(=O)N[C@@H](CC(C)(C)C)C(=O)Nc1nccs1