Reaction Details
TargetC-C chemokine receptor type 2
LigandBDBM50103142
Substrate/Competitorn/a
Meas. Tech.ChEMBL_41906 (CHEMBL655697)
Ki 40±n/a nM
Citation Witherington, JBordas, VCooper, DGForbes, ITGribble, ADIfe, RJBerkhout, TGohil, JGroot, PH Conformationally restricted indolopiperidine derivatives as potent CCR2B receptor antagonists. Bioorg Med Chem Lett11:2177-80 (2001) C-C chemokine receptor type 2
Name:C-C chemokine receptor type 2
Type:Enzyme
Mol. Mass.:41932.32
Organism:Homo sapiens (Human)
Description:P41597
Residue:374
BDBM50103142
NameBDBM50103142
Synonyms:(E)-3-(3,4-Dichloro-phenyl)-N-{4-[(R)-3-((2S,7aS)-5-hydroxy-1H-indol-3-yl)-8-aza-bicyclo[3.2.1]oct-8-ylmethyl]-cyclohexyl}-acrylamide | CHEMBL71707
TypeSmall organic molecule
Emp. Form.C31H35Cl2N3O2
Mol. Mass.552.535
SMILESOc1ccc2[nH]cc([C@H]3C[C@@H]4CC[C@H](C3)N4C[C@H]3CC[C@H](CC3)NC(=O)\C=C\c3ccc(Cl)c(Cl)c3)c2c1