Reaction Details
Target5-hydroxytryptamine receptor 1E
LigandBDBM50091438
Substrate/Competitorn/a
Meas. Tech.ChEMBL_2070 (CHEMBL616714)
Ki 6.3±n/a nM
Citation Witherington, JBordas, VCooper, DGForbes, ITGribble, ADIfe, RJBerkhout, TGohil, JGroot, PH Conformationally restricted indolopiperidine derivatives as potent CCR2B receptor antagonists. Bioorg Med Chem Lett11:2177-80 (2001) 5-hydroxytryptamine receptor 1E
Name:5-hydroxytryptamine receptor 1E
Type:G Protein-Coupled Receptor (GPCR)
Mol. Mass.:41697.80
Organism:Homo sapiens (Human)
Description:gi_112822
Residue:365
BDBM50091438
NameBDBM50091438
Synonyms:(E)-3-(3,4-Dichloro-phenyl)-N-{5-[4-(5-hydroxy-1H-indol-3-yl)-piperidin-1-yl]-pentyl}-acrylamide 3-(3,4-dichlorophenyl)-N-(5-(4-(5-hydroxy-1H-indol-3-yl)piperidin-1-yl)pentyl)acrylamide TCMDC-139245
TypeSmall organic molecule
Emp. Form.C27H31Cl2N3O2
Mol. Mass.500.46
SMILESOc1ccc2[nH]cc(C3CCN(CCCCCNC(=O)\C=C\c4ccc(Cl)c(Cl)c4)CC3)c2c1