Reaction Details
TargetGlucocorticoid receptor
LigandBDBM50062433
Substrate/Competitorn/a
Meas. Tech.ChEMBL_71404 (CHEMBL680190)
Ki 9.3±n/a nM
Citation Coghlan, MJKym, PRElmore, SWWang, AXLuly, JRWilcox, DStashko, MLin, CWMiner, JTyree, CNakane, MJacobson, PLane, BC Synthesis and characterization of non-steroidal ligands for the glucocorticoid receptor: selective quinoline derivatives with prednisolone-equivalent functional activity. J Med Chem44:2879-85 (2001) Glucocorticoid receptor
Name:Glucocorticoid receptor
Type:Enzyme
Mol. Mass.:85656.87
Organism:Homo sapiens (Human)
Description:P04150
Residue:777
BDBM50062433
NameBDBM50062433
Synonyms:9-Chloro-2,2,4-trimethyl-5-phenyl-2,5-dihydro-1H-6-oxa-1-aza-chrysene | CHEMBL318409
TypeSmall organic molecule
Emp. Form.C25H22ClNO
Mol. Mass.387.901
SMILESCC1=CC(C)(C)Nc2ccc3-c4cc(Cl)ccc4OC(c4ccccc4)c3c12