Reaction Details
TargetCoagulation factor VII/Tissue factor
LigandBDBM50103652
Substrate/Competitorn/a
Meas. Tech.ChEMBL_69535 (CHEMBL680624)
Ki 5±n/a nM
Citation Young, WBKolesnikov, ARai, RSprengeler, PALeahy, EMShrader, WDSangalang, JBurgess-Henry, JSpencer, JElrod, KCregar, L Optimization of a screening lead for factor VIIa/TF. Bioorg Med Chem Lett11:2253-6 (2001) Coagulation factor VII/Tissue factor
Name:Coagulation factor VII/Tissue factor
Type:n/a
Mol. Mass.:n/a
Description:ASSAY_ID of EBI is 69535
Components:This complex has 2 components.
Component 1
Name:Tissue factor
Synonyms:CD_antigen=CD142 Coagulation factor VII/tissue factor TF Thromboplastin | Tissue factor
Type:PROTEIN
Mol. Mass.:33067.61
Organism:Homo sapiens (Human)
Description:ChEMBL_936735
Residue:295
Component 2
Name:Coagulation factor VII
Synonyms:Eptacog alfa FA7_HUMAN Factor VIIa (fVIIa) SPCA serum prothrombin conversion accelerator
Type:Enzyme
Mol. Mass.:51599.89
Organism:Homo sapiens (Human)
Description:n/a
Residue:466
BDBM50103652
NameBDBM50103652
Synonyms:5-(5-Carbamimidoyl-1H-indol-2-yl)-6-hydroxy-3'-nitro-biphenyl-3-carboxylic acid | CHEMBL307381
TypeSmall organic molecule
Emp. Form.C22H16N4O5
Mol. Mass.416.3862
SMILESNC(=N)c1ccc2[nH]c(cc2c1)-c1cc(cc(c1O)-c1cccc(c1)[N+]([O-])=O)C(O)=O